number of counted ribbons
type: Concept
has status: Published
modified: 2014-07-18T11:58:21Z
broader: c2 133
definition: number of counted ribbons among all ribbons during perch spawning
definition: c1 def en 131fe012
definition: nombre de rubans comptés parmis tous les rubans de la fraie des perches @fr
definition: c1 def fr 3fef8d7d
in scheme: anaeeThes
preferred label: nombre de rubans comptés @fr

RDF description of c3_356
primary topic: number of counted ribbons