RDF description of c3_358
primary topic: number of ribbons

number of ribbons
type: Concept
has status: Published
modified: 2014-07-18T11:59:02Z
broader: c2 133
definition: c1 def fr 95e5c199
definition: c1 def en 608d3b9f
definition: number of ribbons during perch spawning
definition: nombre de rubans durant la fraie des perches @fr
in scheme: anaeeThes
preferred label: nombre de rubans @fr