RDF description of c3_360
primary topic: ribbon width

ribbon width
type: Concept
has status: Published
modified: 2014-07-18T11:58:52Z
broader: c2 133
definition: c1 def en 38e5ff5f
definition: ribbon width of counted ribbons durinf perch spawning
definition: largeur du ruban des rubans comptés lors de la fraie des perches @fr
definition: c1 def fr 74e8bec5
in scheme: anaeeThes
preferred label: largeur du ruban @fr