âge 1er retour
type: Concept
has status: Published
modified: 2014-07-18T11:52:27Z
broader: c3 3378
definition: c1 def fr 53e90355
definition: Nombre d’hivers passés en mer avant le premier retour en rivière ou en lac
in scheme: anaeeThes
preferred label: age at first return @en

RDF description of c3_362
primary topic: âge 1er retour