RDF description of c3_383
primary topic: egg

egg
type: Concept
has status: Published
modified: 2014-07-18T11:55:52Z
broader: c2 132
definition: i def c3 383
definition: c1 def fr 7d7c5cd9
definition: A large, female sex cell enclosed in a porous, calcareous or leathery shell, produced by birds and reptiles.
definition: nombre d'oeufs comptes @fr
in scheme: anaeeThes
preferred label: oeuf @fr