embryon
type: Concept
has status: Published
modified: 2014-07-18T11:55:28Z
broader: c2 132
definition: i def c3 384
definition: nombre embryon
definition: c1 def fr 0029ffb7
definition: An early stage of development in multicellular organisms. @en
in scheme: anaeeThes
preferred label: embryo @en

RDF description of c3_384
primary topic: embryon