RDF description of c3_396
primary topic: animal juvénile

animal juvénile
type: Concept
has status: Published
modified: 2020-04-25T01:29:08.147+02:00
alternative label: juvenile @en
alternative label: juvénile
broader: c2 132
definition: c1 def fr 61f1ae8a
definition: juvenile males et femelles non differencies
in scheme: anaeeThes
preferred label: juvenile animal @en