RDF description of c_1401956320471
primary topic: ecosystem ecology

ecosystem ecology
type: Concept
has status: Published
created: 2014-06-05T08:18:43Z
modified: 2017-03-21T14:18:28Z
broader: c_1401956207670
definition: Ecosystem ecology is the integrated study of living (biotic) and non-living (abiotic) components of ecosystems and their interactions within an ecosystem framework. This science examines how ecosystems work and relates this to their components such as chemicals, bedrock, soil, plants, and animals.
in scheme: anaeeThes
narrower: c_1401958122334
narrower: c_1401958271616
preferred label: écologie écosystémique @fr