trophic ecology
type: Concept
has status: Published
created: 2014-06-05T08:48:03Z
modified: 2017-03-09T16:38:03Z
broader: c_1401957995939
definition: The study of the feeding relationships of organisms in communities and ecosystems. Trophic links between populations represent flows of organisms, organic energy and nutrients. Trophic transfers are important in population dynamics, biogeochemistry, and ecosystem energetics.
definition: i def c 1401958079328
in scheme: anaeeThes
preferred label: écologie trophique @fr

RDF description of c_1401958079328
primary topic: trophic ecology