monitoring
type: Concept
has status: Published
created: 2014-06-05T08:52:46Z
modified: 2017-03-13T08:25:08Z
broader: c2 115
definition: i def c 1401958363004
definition: To check regularly in order to perceive change in some quality or quantity.
in scheme: anaeeThes
narrower: c_1401958534797
narrower: c_1401959300895
narrower: c_1401956485496
narrower: c_1401958445302
narrower: c_1401958384374
narrower: c_1401959271081
narrower: c_1405702907587
narrower: c 2a2eb2d6
narrower: c_1401959334347
narrower: c_1402045483644
narrower: c_1401973611883
narrower: c_1403181364921
narrower: c_1402045509364
narrower: c_1406557059747
narrower: c_1401958480594
narrower: c_1403181392341
preferred label: surveillance @fr

RDF description of c_1401958363004
primary topic: monitoring