animal ecology
type: Concept
has status: Published
created: 2014-06-05T08:56:28Z
modified: 2017-03-08T09:20:14Z
broader: c_1401957995939
definition: i def c 1401958585397
definition: A study of the relationships of animals to their environment.
in scheme: anaeeThes
preferred label: écologie animale @fr

RDF description of c_1401958585397
primary topic: animal ecology