RDF description of c_1401958625930
primary topic: biology

biology
type: Concept
has status: Published
created: 2014-06-05T08:57:09Z
modified: 2017-03-21T13:43:18Z
broader: c_1401956207670
definition: A division of the natural sciences concerned with the study of life and living organisms. (Source: MGH)
in scheme: anaeeThes
narrower: c eb6d52b1
narrower: c_1401956299094
narrower: c_1401956447377
narrower: c_1437411456907
narrower: c_1401956339736
narrower: c3 2332
narrower: c3 2333
preferred label: biologie @fr