RDF description of c_1401959090767
primary topic: population ecology

population ecology
type: Concept
has status: Published
created: 2014-06-05T09:04:54Z
modified: 2020-04-06T10:20:16.908+02:00
alternative label: écologie des populations @fr
alternative label: population and community ecology
broader: c_1401957995939
definition: i def c 1401959090767
definition: The study of the interaction of a particular species or genus population with its environment.
in scheme: anaeeThes
preferred label: écologie des communautés @fr