RDF description of c_1401959375773
primary topic: environmental science

environmental science
type: Concept
has status: Published
created: 2014-06-05T09:09:39Z
modified: 2020-11-30T20:00:21.859+01:00
alternative label: environmental sciences
broader: c_1401956207670
definition: i def c 1401959375773
definition: Environmental science is a multidisciplinary academic field that integrates physical, biological and information sciences (including but not limited to ecology, biology, physics, chemistry, zoology, mineralogy, oceanology, limnology, soil science, geology, atmospheric science, geography and geodesy) to the study of the environment, and the solution of environmental problems. Environmental science emerged from the fields of natural history and medicine during the Enlightenment.[1] Today it provides an integrated, quantitative, and interdisciplinary approach to the study of environmental systems.[2]
definition: The interdisciplinary study of environmental problems, within the framework of established physical and biological principles, i.e. oriented toward a scientific approach.
in scheme: anaeeThes
preferred label: science environnementale @fr