climatic experiment
type: Concept
has status: Published
created: 2014-06-05T12:59:33Z
modified: 2017-03-13T13:49:25Z
broader: c_1401973021389
definition: i def c 1401973170123
definition: Experiments conducted to estimate future climatic conditions employing modelling of the physical processes underlying climatic change and variability; also, assessments are required of uncertain future man-made inputs such as increasing atmospheric carbon dioxide and other green-house gases.
in scheme: anaeeThes
narrower: c_1403181093462
narrower: c_1438248614514
narrower: c_1444918638893
preferred label: expérience climatique @fr

RDF description of c_1401973170123
primary topic: climatic experiment