physicochemical analysis
type: Concept
has status: Published
created: 2014-06-05T13:06:18Z
modified: 2017-03-21T14:18:37Z
broader: c_1401973548673
definition: i def c 1401973575044
definition: Analysis based on the physical changes associated with chemical reactions.
in scheme: anaeeThes
narrower: c_1406132196767
narrower: c_1406133138185
narrower: c_1406129570059
narrower: c_1406129716090
narrower: c_1406129756071
preferred label: analyse physico-chimique @fr

RDF description of c_1401973575044
primary topic: physicochemical analysis