mowing
type: Concept
has status: Published
created: 2014-06-10T07:31:48Z
modified: 2017-03-09T17:03:17Z
alternative label: cut
broader: c3 2699
definition: The cutting down of grass, crops or grain with a scythe or a mechanical device.
definition: i def c 1402385500610
in scheme: anaeeThes
preferred label: fauchage @fr

RDF description of c_1402385500610
primary topic: mowing