RDF description of c_1402411130982
primary topic: training

training
type: Concept
has status: Published
created: 2014-06-10T14:38:54Z
modified: 2017-03-21T14:18:49Z
broader: c2 169
definition: i def c 1402411130982
definition: The process of bringing a person or a group of persons to an agreed standard of proficiency, by practice and instruction.
in scheme: anaeeThes
preferred label: entrainement @fr