RDF description of c_1403016973246
primary topic: pool

pool
type: Concept
has status: Published
created: 2014-06-17T14:56:16Z
modified: 2017-03-13T08:53:45Z
broader: c 43043f32
definition: A small, natural body of standing water, usually fresh; e.g. a stagnant body of water in a marsh, or a still body of water within a cave.
definition: i def c 1403016973246
in scheme: anaeeThes
preferred label: bassin @fr