plant breeding
type: Concept
has status: Published
created: 2014-06-17T14:57:25Z
modified: 2017-08-21T10:48:21Z
broader: c3 2556
definition: i def c 1403017042069
definition: Raising a certain type of plant by crossing one variety with another to produce a new variety where the desired characteristics are strongest.
in scheme: anaeeThes
preferred label: sélection végétale @fr

RDF description of c_1403017042069
primary topic: plant breeding