RDF description of c_1403017105870
primary topic: organic contaminant

organic contaminant
type: Concept
has status: Published
created: 2014-06-17T14:58:29Z
modified: 2017-03-13T09:44:22Z
broader: c3 343
definition: A plant- or animal-produced pollutant containing mainly carbon, hydrogen and oxygen.
definition: i def c 1403017105870
in scheme: anaeeThes
preferred label: contaminant organique @fr