landscape
type: Concept
has status: Published
created: 2014-06-17T15:09:46Z
modified: 2017-03-21T13:43:34Z
broader: c_1402038969162
definition: i def c 1403017782223
definition: The traits, patterns, and structure of a specific geographic area, including its biological composition, its physical environment, and its anthropogenic or social patterns. An area where interacting ecosystems are grouped and repeated in similar form.
in scheme: anaeeThes
preferred label: paysage @fr

RDF description of c_1403017782223
primary topic: landscape