RDF description of c_1403180947463
primary topic: climate change

climate change
type: Concept
has status: Published
created: 2014-06-19T12:29:11Z
modified: 2020-03-27T09:51:59.948+01:00
broader: c_1403180758864
definition: The long-term fluctuations in temperature, precipitation, wind, and all other aspects of the Earth's climate. External processes, such as solar-irradiance variations, variations of the Earth's orbital parameters (eccentricity, precession, and inclination), lithosphere motions, and volcanic activity, are factors in climatic variation. Internal variations of the climate system, e.g., changes in the abundance of greenhouse gases, also may produce fluctuations of sufficient magnitude and variability to explain observed climate change through the feedback processes interrelating the components of the climate system.
definition: i def c 1403180947463
in scheme: anaeeThes
narrower: c_1438872815571
narrower: c 488636ed
narrower: c_1438849487443
preferred label: changement climatique @fr