freshwater resource
type: Concept
has status: Published
created: 2014-06-19T12:33:57Z
modified: 2017-03-22T15:40:39Z
broader: c_1403018256974
definition: i def c 1403181233546
definition: The network of rivers, lakes, and other surface waters that supply water for food production and other essential human systems.
in scheme: anaeeThes
preferred label: ressource d'eau douce @fr

RDF description of c_1403181233546
primary topic: freshwater resource