RDF description of c_1403181392341
primary topic: biomarker

biomarker
type: Concept
has status: Published
created: 2014-06-19T12:36:36Z
modified: 2017-03-21T14:18:53Z
broader: c_1401958363004
definition: A normal metabolite that, when present in abnormal concentrations in certain body fluids, can indicate the presence of a particular disease or toxicological condition.
definition: i def c 1403181392341
in scheme: anaeeThes
preferred label: biomarqueur @fr