germination
type: Concept
has status: Published
created: 2014-06-30T11:19:43Z
modified: 2020-04-25T05:16:48.982+02:00
broader: c3 2504
definition: i def c 1404127179012
definition: The beginning or the process of development of a spore or seed.
in scheme: anaeeThes

RDF description of c_1404127179012
primary topic: germination