RDF description of c_1405697502964
primary topic: chemical analysis

chemical analysis
type: Concept
has status: Published
created: 2014-07-18T15:31:47Z
modified: 2017-03-21T14:18:38Z
broader: c_1401973548673
definition: i def c 1405697502964
definition: The complex of operations aiming to determine the kinds of constituents of a given substance.
in scheme: anaeeThes
narrower: c_1406293860200
narrower: c_1406296141304
narrower: c_1406293990344
narrower: c_1406293958632
narrower: c_1406293724484
narrower: c_1406296015747
narrower: c_1406295973243
narrower: c_1406129827244
narrower: c_1406293751488
narrower: c_1406293877792
narrower: c_1406294012697
narrower: c_1406293840872
narrower: c_1406295955915
narrower: c_1406293894154
narrower: c_1405699888226
narrower: c_1406295878370
narrower: c_1406295913129
narrower: c_1406295815650
narrower: c_1406296056377
narrower: c_1406294028125
narrower: c_1406295750194
narrower: c_1406296032574
narrower: c_1406293914303
narrower: c f49cd4e0
narrower: c_1406296073170
narrower: c_1405697785261
narrower: c_1405697600953
narrower: c_1406129177217
narrower: c_1406293795225
narrower: c_1406295940553
narrower: c_1406296171574
narrower: c_1406296125759
narrower: c_1405698560643
narrower: c_1405699386090
narrower: c_1406295846106
narrower: c_1406293941569
narrower: c_1406132242730
narrower: c_1406295997374
narrower: c_1406293687764
narrower: c_1406293768312
narrower: c_1406296155272
narrower: c_1405698446749
narrower: c_1406294043856
narrower: c_1406296097368
narrower: c_1406295863410
narrower: c_1406295830937
narrower: c_1406293823796
narrower: c_1406295781386
narrower: c_1405697646837
narrower: c_1406295894010
preferred label: analyse chimique @fr