sorption
type: Concept
has status: Published
created: 2014-07-18T15:59:35Z
modified: 2020-04-17T09:20:35+02:00
broader: c2 2695
definition: The taking up, usually, of a liquid or gas into the body of another material (the absorbent). Thus, for instance, an air pollutant may be removed by absorption in a suitable solvent.
definition: i def c 1405699171283
in scheme: anaeeThes

RDF description of c_1405699171283
primary topic: sorption