RDF description of c_1405943282232
primary topic: mediterranean forest

mediterranean forest
type: Concept
has status: Published
created: 2014-07-21T11:48:06Z
modified: 2014-12-08T09:39:28Z
broader: c_1437639244292
definition: Type of forest found in the Mediterranean area comprising mainly xerophilous evergreen trees.
definition: i def c 1405943282232
in scheme: anaeeThes
preferred label: forêt méditerranéenne @fr