respiration
type: Concept
has status: Published
created: 2014-07-23T16:06:54Z
modified: 2017-03-22T15:09:52Z
broader: c3 36
definition: i def c 1406131609604
definition: The process in living organisms of taking in oxygen from the surroundings and giving out carbon dioxide.
in scheme: anaeeThes
narrower: c b73ba6fc
narrower: c_1406290902782
narrower: c_1406131636099

RDF description of c_1406131609604
primary topic: respiration