RDF description of c_1406132749304
primary topic: excavation

excavation
type: Concept
has status: Published
created: 2014-07-23T16:25:53Z
modified: 2017-03-21T14:18:42Z
broader: c_1405700177311
definition: i def c 1406132749304
definition: The removal of earth from its natural position.
in scheme: anaeeThes