microscopy
type: Concept
has status: Published
created: 2014-07-23T16:32:22Z
modified: 2017-03-28T14:37:27Z
broader: c_1401973575044
definition: The interpretative application of microscope magnification to the study of materials that cannot be properly seen by the unaided eye.
definition: i def c 1406133138185
in scheme: anaeeThes
preferred label: microscopie @fr

RDF description of c_1406133138185
primary topic: microscopy