RDF description of c_1437049245652
primary topic: point

point
type: Concept
has status: Validated
created: 2015-07-16T12:20:51Z
modified: 2016-01-06T10:00:38Z
broader: c2 117
definition: A position on a reference system determined by a survey.
definition: i def c 1437049245652
in scheme: anaeeThes