RDF description of c_1437411456907
primary topic: physiology

physiology
type: Concept
has status: Published
created: 2015-07-20T16:57:41Z
modified: 2017-03-09T08:22:59Z
broader: c_1401958625930
definition: The biological study of the functions of living organisms and their parts. (Source: AMHER)
in scheme: anaeeThes
preferred label: physiologie @fr