RDF description of c_1437639701636
primary topic: conifer

conifer
type: Concept
has status: Published
created: 2015-07-23T08:21:47Z
modified: 2017-03-15T15:03:10Z
alternative label: gymnosperm
broader: c2 250
definition: i def c 1437639701636
definition: An order of conebearing plants which includes nearly all the present day Gymnospermae. Most are tall evergreen trees with needle-like (e.g., pines), linear (e.g. firs) or scale-like (e.g., cedars) leaves. They are characteristic of temperate zones and the main forest trees of colder regions. They provide timber, resins, tars, turpentine and pulp for paper.
in scheme: anaeeThes
narrower: c 977d1fb9
narrower: c 4dc51d93
narrower: c 63b43e00
narrower: c f9dbe8ac
narrower: c 8983f440
narrower: c 7d40a79d
preferred label: conifère @fr