RDF description of c_1438271882740
primary topic: canopy surface

canopy surface
type: Concept
has status: Published
created: 2015-07-30T15:58:08Z
modified: 2020-04-24T11:40:11.374+02:00
broader: c2 2984
definition: The canopy surface is an undulating surface that follows the irregular contours of the upper tree crowns and defines the inner and the outer limits of the forest volume
in scheme: anaeeThes
preferred label: surface de la canopée @fr