population density
type: Concept
has status: Published
created: 2015-08-06T08:03:43Z
modified: 2017-03-15T15:03:18Z
broader: c2 3027
definition: i def c 1438848217835
definition: The number of people relative to the space occupied by them.
in scheme: anaeeThes
preferred label: densité de population @fr

RDF description of c_1438848217835
primary topic: population density