RDF description of c_1438850028250
primary topic: mixed forest

mixed forest
type: Concept
has status: Published
created: 2015-08-06T08:33:54Z
modified: 2017-03-21T14:18:36Z
broader: c_1438244547853
definition: A forest composed of several tree species.
definition: i def c 1438850028250
in scheme: anaeeThes
narrower: c 1ccc6002
narrower: c a26dc6bc
narrower: c 1e28b0e6
preferred label: forêt mixte @fr