RDF description of c_1438850358339
primary topic: forest management

forest management
type: Concept
has status: Published
created: 2015-08-06T08:39:24Z
modified: 2017-03-09T08:57:44Z
broader: c3 2556
definition: i def c 1438850358339
definition: Planning of forest utilization for wood production, conservation purposes, fauna and flora protection, recreation and water supply.
in scheme: anaeeThes
preferred label: gestion forestière @fr