RDF description of c_1438871958817
primary topic: deposition

deposition
type: Concept
has status: Published
created: 2015-08-06T14:39:24Z
modified: 2017-03-13T08:25:03Z
broader: c2 113
definition: The process by which polluting material is precipitated from the atmosphere and accumulates in ecosystems.
definition: i def c 1438871958817
in scheme: anaeeThes
narrower: c 4986a5a2
narrower: c_1438872064253
narrower: c_1438872013350
preferred label: dépôt @fr