RDF description of c_1438873596178
primary topic: soil pollution

soil pollution
type: Concept
has status: Published
created: 2015-08-06T15:06:42Z
modified: 2017-03-21T13:43:30Z
broader: c2 113
definition: Modifications of soil features or, more generally, of its chemical and biological balance, caused by the discharge of polluting substances.
definition: i def c 1438873596178
in scheme: anaeeThes
preferred label: pollution du sol @fr