air pollution
type: Concept
has status: Published
created: 2015-08-07T07:43:11Z
modified: 2017-03-21T13:42:49Z
broader: c2 2446
definition: i def c 1438933384943
definition: Presence in the atmosphere of large quantities of gases, solids and radiation produced by the burning of natural and artificial fuels, chemical and other industrial processes and nuclear explosions.
in scheme: anaeeThes
preferred label: pollution de l'air @fr

RDF description of c_1438933384943
primary topic: air pollution