RDF description of c_1438940097259
primary topic: energy balance

energy balance
type: Concept
has status: Published
created: 2015-08-07T09:35:03Z
modified: 2017-03-21T14:18:15Z
alternative label: energy budget
broader: c_1402042815900
definition: The energetic state of a system at any given time.
definition: i def c 1438940097259
in scheme: anaeeThes
preferred label: bilan énergétique @fr