trace element
type: Concept
has status: Published
created: 2015-08-07T09:47:07Z
modified: 2017-03-13T08:14:05Z
broader: c2 2308
definition: i def c 1438940821131
definition: Any of various chemical elements that occur in very small amounts in organisms and are essential for many physiological and biochemical processes.
in scheme: anaeeThes
narrower: c 98414a7e
preferred label: élément trace @fr

RDF description of c_1438940821131
primary topic: trace element