stocking
type: Concept
has status: Published
created: 2015-08-07T09:48:57Z
modified: 2017-03-21T13:43:30Z
broader: c2 113
definition: To keep a supply accumulated for future use.
definition: i def c 1438940932444
in scheme: anaeeThes
preferred label: stockage @fr

RDF description of c_1438940932444
primary topic: stocking