RDF description of c_1438941588254
primary topic: fertiliser

fertiliser
type: Concept
has status: Published
created: 2015-08-07T09:59:54Z
modified: 2017-03-09T08:57:43Z
alternative label: fertilizer
broader: c2 166
definition: Substance added to soil for the purpose of promoting plant life, usually containing nitrogen, potassium and phosphorus, e.g. manure, guano, rock phosphates.
definition: i def c 1438941588254
in scheme: anaeeThes
narrower: c_1438941615506
preferred label: engrais @fr