selective breeding of animals
type: Concept
has status: Published
created: 2015-08-07T13:25:42Z
modified: 2017-03-13T08:25:13Z
broader: c_1403016736840
definition: i def c 1438953936268
definition: Breeding of animals having desirable characters.
in scheme: anaeeThes
preferred label: élevage de races animalières sélectionnées @fr

RDF description of c_1438953936268
primary topic: selective breeding of animals