environmental information system
type: Concept
has status: Published
created: 2015-08-07T13:57:42Z
modified: 2017-03-21T13:43:22Z
broader: c_1403018120212
definition: i def c 1438955856438
definition: A coordinated assemblage of people, devices or other resources designed to exchange data or knowledge concerning any aspect of the ecosystem, the natural resources within or, more generally, the external factors surrounding and affecting human life.
in scheme: anaeeThes
preferred label: système d'information environnemental @fr

RDF description of c_1438955856438
primary topic: environmental information system