RDF description of c_1438956487143
primary topic: biotic factor

biotic factor
type: Concept
has status: Published
created: 2015-08-07T14:08:13Z
modified: 2017-03-13T08:25:03Z
alternative label: biotic factors
broader: c2 113
definition: The influence upon the environment of organisms owing to the presence and activities of other organisms, as distinct from a physical, abiotic, environmental factor.
definition: i def c 1438956487143
in scheme: anaeeThes
preferred label: facteur biotique @fr