RDF description of c_1438958922643
primary topic: soil chemistry

soil chemistry
type: Concept
has status: Published
created: 2015-08-07T14:48:49Z
modified: 2017-03-08T09:20:24Z
broader: c_1438959032248
definition: The study of the inorganic and organic components of the soil and its life cycles.
definition: i def c 1438958922643
in scheme: anaeeThes
preferred label: chimie du sol @fr